Target
Sodium-dependent noradrenaline transporter
Ligand
BDBM50156915
Substrate
Meas. Tech.
ChEMBL_429832 (CHEMBL915413)
Ki
3.1±n/a nM
Citation
 Carroll, FIRunyon, SPAbraham, PNavarro, HKuhar, MJPollard, GTHoward, JL Monoamine transporter binding, locomotor activity, and drug discrimination properties of 3-(4-substituted-phenyl)tropane-2-carboxylic acid methyl ester isomers. J Med Chem 47:6401-9 (2004)  
Target
Name:
Sodium-dependent noradrenaline transporter
Synonyms:
Monoamine transporter NET Noradrenaline Transporter (NET) Norepinephrine transporter protein (NET) SLC6A2 Sodium-dependent noradrenaline transporter (NET) | Solute carrier family 6 member 2
Type:
Multi-pass membrane protein
Mol. Mass.:
69337.72
Organism:
Homo sapiens (Human)
Description:
P23975
Residue:
617
  
Inhibitor
Name:
BDBM50156915
Synonyms:
(2R,3S)-methyl 3-(4-chlorophenyl)-8-methyl-8-aza-bicyclo[3.2.1]octane-2-carboxylate CHEMBL375888
Type:
Small organic molecule
Emp. Form.:
C16H20ClNO2
Mol. Mass.:
293.789
SMILES:
COC(=O)[C@@H]1C2CCC(C[C@H]1c1ccc(Cl)cc1)N2C
: