Target
Thymidylate synthase
Ligand
BDBM50158535
Substrate
Meas. Tech.
ChEMBL_430600 (CHEMBL918702)
IC50
>17000±n/a nM
Citation
 Gangjee, AZeng, YMcGuire, JJMehraein, FKisliuk, RL Synthesis of classical, three-carbon-bridged 5-substituted furo[2,3-d]pyrimidine and 6-substituted pyrrolo[2,3-d]pyrimidine analogues as antifolates. J Med Chem 47:6893-901 (2004)  
Target
Name:
Thymidylate synthase
Synonyms:
TS TYMS Thymidylate synthase (TS) | Thymidylate synthase/GAR transformylase/AICAR transformylase
Type:
Enzyme
Mol. Mass.:
35718.07
Organism:
Homo sapiens (Human)
Description:
Residue:
313
  
Inhibitor
Name:
BDBM50158535
Synonyms:
CHEMBL374172 | N-{4-[3-(2-amino-3,4-dihydro-4-oxo-7H-pyrrolo[2,3-d]-pyrimidin-6-yl)propyl]benzoyl}-L-glutamic acid
Type:
Small organic molecule
Emp. Form.:
C21H23N5O6
Mol. Mass.:
441.4372
SMILES:
Nc1nc2[nH]cc(CCCc3ccc(cc3)C(=O)N[C@@H](CCC(O)=O)C(O)=O)c2c(=O)[nH]1
: