Target
Metabotropic glutamate receptor 5
Ligand
BDBM50123005
Substrate
Meas. Tech.
ChEMBL_432812 (CHEMBL914080)
Ki
11±n/a nM
Citation
 Hintermann, SVranesic, IAllgeier, HBrülisauer, AHoyer, DLemaire, MMoenius, TUrwyler, SWhitebread, SGasparini, FAuberson, YP ABP688, a novel selective and high affinity ligand for the labeling of mGlu5 receptors: identification, in vitro pharmacology, pharmacokinetic and biodistribution studies. Bioorg Med Chem 15:903-14 (2006)  
Target
Name:
Metabotropic glutamate receptor 5
Synonyms:
GRM5_RAT Grm5 Mglur5 metabotropic glutamate 5/1-C metabotropic glutamate 5a
Type:
Enzyme
Mol. Mass.:
131900.14
Organism:
Rattus norvegicus (Rat)
Description:
P31424
Residue:
1203
  
Inhibitor
Name:
BDBM50123005
Synonyms:
2-(3-Methoxy-phenylethynyl)-6-methyl-pyridine CHEMBL332397
Type:
Small organic molecule
Emp. Form.:
C15H13NO
Mol. Mass.:
223.2698
SMILES:
COc1cccc(c1)C#Cc1cccc(C)n1
: