Target
Beta-lactamase
Ligand
BDBM50370963
Substrate
Meas. Tech.
ChEMBL_433253 (CHEMBL914658)
Ki
4500±n/a nM
Citation
 Thomson, JMPrati, FBethel, CRBonomo, RA Use of novel boronic acid transition state inhibitors to probe substrate affinity in SHV-type extended-spectrum beta-lactamases. Antimicrob Agents Chemother 51:1577-9 (2007)  
Target
Name:
Beta-lactamase
Synonyms:
SHV-5 extended spectrum beta-lactamase
Type:
PROTEIN
Mol. Mass.:
31312.77
Organism:
Escherichia coli
Description:
ChEMBL_433253
Residue:
286
  
Inhibitor
Name:
BDBM50370963
Synonyms:
CEFTAZIDIME BATSI
Type:
Small organic molecule
Emp. Form.:
C10H15BN4O6S
Mol. Mass.:
330.125
SMILES:
CC(C)(O\N=C(/C(=O)NCB(O)O)c1csc(N)n1)C(O)=O
: