Target
Adenosine receptor A2b
Ligand
BDBM50205582
Substrate
Meas. Tech.
ChEMBL_435759 (CHEMBL904113)
EC50
107±n/a nM
Citation
 Baraldi, PGPreti, DTabrizi, MAFruttarolo, FSaponaro, GBaraldi, SRomagnoli, RMoorman, ARGessi, SVarani, KBorea, PA N(6)-[(hetero)aryl/(cyclo)alkyl-carbamoyl-methoxy-phenyl]-(2-chloro)-5'-N-ethylcarboxamido-adenosines: the first example of adenosine-related structures with potent agonist activity at the human A(2B) adenosine receptor. Bioorg Med Chem 15:2514-27 (2007)  
Target
Name:
Adenosine receptor A2b
Synonyms:
AA2BR_HUMAN ADORA2B Adenosine receptors A2b | Adenosine receptors; A2a & A2b
Type:
G Protein-Coupled Receptor (GPCR)
Mol. Mass.:
36341.22
Organism:
Homo sapiens (Human)
Description:
Residue:
332
  
Inhibitor
Name:
BDBM50205582
Synonyms:
1-deoxy-1-[6-{4-[(2-trifluoromethyl-phenylcarbamoyl)-methoxy]-phenylamino}-9H-purin-9-yl]-N-ethyl-beta-D-ribofuranuronamide | CHEMBL225579
Type:
Small organic molecule
Emp. Form.:
C27H26F3N7O6
Mol. Mass.:
601.5338
SMILES:
CCNC(=O)[C@H]1O[C@H]([C@H](O)[C@@H]1O)n1cnc2c(Nc3ccc(OCC(=O)Nc4ccccc4C(F)(F)F)cc3)ncnc12
: