Target
Adenosine receptor A2b
Ligand
BDBM50205593
Substrate
Meas. Tech.
ChEMBL_435759 (CHEMBL904113)
EC50
45.4±n/a nM
Citation
 Baraldi, PGPreti, DTabrizi, MAFruttarolo, FSaponaro, GBaraldi, SRomagnoli, RMoorman, ARGessi, SVarani, KBorea, PA N(6)-[(hetero)aryl/(cyclo)alkyl-carbamoyl-methoxy-phenyl]-(2-chloro)-5'-N-ethylcarboxamido-adenosines: the first example of adenosine-related structures with potent agonist activity at the human A(2B) adenosine receptor. Bioorg Med Chem 15:2514-27 (2007)  
Target
Name:
Adenosine receptor A2b
Synonyms:
AA2BR_HUMAN ADORA2B Adenosine receptors A2b | Adenosine receptors; A2a & A2b
Type:
G Protein-Coupled Receptor (GPCR)
Mol. Mass.:
36341.22
Organism:
Homo sapiens (Human)
Description:
Residue:
332
  
Inhibitor
Name:
BDBM50205593
Synonyms:
(2S,3S,4R,5R)-5-(6-(4-(2-(3,4-dimethoxyphenylamino)-2-oxoethoxy)phenylamino)-9H-purin-9-yl)-N-ethyl-3,4-dihydroxy-tetrahydrofuran-2-carboxamide CHEMBL226244
Type:
Small organic molecule
Emp. Form.:
C28H31N7O8
Mol. Mass.:
593.5878
SMILES:
CCNC(=O)[C@H]1O[C@H]([C@H](O)[C@@H]1O)n1cnc2c(Nc3ccc(OCC(=O)Nc4ccc(OC)c(OC)c4)cc3)ncnc12
: