Target
Proto-oncogene tyrosine-protein kinase Src
Ligand
BDBM50198799
Substrate
Meas. Tech.
ChEMBL_437736 (CHEMBL905921)
IC50
282±n/a nM
Citation
 Noronha, GBarrett, KBoccia, ABrodhag, TCao, JChow, CPDneprovskaia, EDoukas, JFine, RGong, XGritzen, CGu, HHanna, EHood, JDHu, SKang, XKey, JKlebansky, BKousba, ALi, GLohse, DMak, CCMcPherson, APalanki, MSPathak, VPRenick, JShi, FSoll, RSplittgerber, UStoughton, STang, SYee, SZeng, BZhao, NZhu, H Discovery of [7-(2,6-dichlorophenyl)-5-methylbenzo [1,2,4]triazin-3-yl]-[4-(2-pyrrolidin-1-ylethoxy)phenyl]amine--a potent, orally active Src kinase inhibitor with anti-tumor activity in preclinical assays. Bioorg Med Chem Lett 17:602-8 (2007)  
Target
Name:
Proto-oncogene tyrosine-protein kinase Src
Synonyms:
Calmodulin/Proto-oncogene tyrosine-protein kinase Src Proto-oncogene c-Src SRC SRC_HUMAN V-src sarcoma (Schmidt-Ruppin A-2) viral oncogene homolog (avian) p60-Src | pp60c-src
Type:
Protein
Mol. Mass.:
59838.60
Organism:
Homo sapiens (Human)
Description:
P12931
Residue:
536
  
Inhibitor
Name:
BDBM50198799
Synonyms:
4-(7-(3-aminophenyl)-5-methylbenzo[e][1,2,4]triazin-3-ylamino)-N-(2-(pyrrolidin-1-yl)ethyl)benzenesulfonamide US8481536, 519
Type:
Small organic molecule
Emp. Form.:
C26H29N7O2S
Mol. Mass.:
503.619
SMILES:
Cc1cc(cc2nnc(Nc3ccc(cc3)S(=O)(=O)NCCN3CCCC3)nc12)-c1cccc(N)c1
: