Target
Ephrin type-B receptor 4
Ligand
BDBM50198782
Substrate
Meas. Tech.
ChEMBL_437765 (CHEMBL905854)
Ki
63.8±n/a nM
Citation
 Noronha, GBarrett, KBoccia, ABrodhag, TCao, JChow, CPDneprovskaia, EDoukas, JFine, RGong, XGritzen, CGu, HHanna, EHood, JDHu, SKang, XKey, JKlebansky, BKousba, ALi, GLohse, DMak, CCMcPherson, APalanki, MSPathak, VPRenick, JShi, FSoll, RSplittgerber, UStoughton, STang, SYee, SZeng, BZhao, NZhu, H Discovery of [7-(2,6-dichlorophenyl)-5-methylbenzo [1,2,4]triazin-3-yl]-[4-(2-pyrrolidin-1-ylethoxy)phenyl]amine--a potent, orally active Src kinase inhibitor with anti-tumor activity in preclinical assays. Bioorg Med Chem Lett 17:602-8 (2007)  
Target
Name:
Ephrin type-B receptor 4
Synonyms:
EPHB4 Ephrin receptor HTK MYK1 Tyrosine-protein kinase TYRO11 | VHL/Ephrin type-B receptor 4
Type:
Enzyme
Mol. Mass.:
108273.51
Organism:
Homo sapiens (Human)
Description:
P54760
Residue:
987
  
Inhibitor
Name:
BDBM50198782
Synonyms:
([7-(2,6-dichloro-phenyl)-5-methyl-benzo[1,2,4]triazin-3-yl]-[4-(2-pyrrolidin-1-yl-ethoxy)-phenyl]-amine) 7-(2,6-dichlorophenyl)-5-methyl-N-[4-(2-pyrrolidin-1-ylethoxy)-phenyl]-1,2,4-benzotriazin-3-amine TG-100435 US8481536, 575
Type:
Small organic molecule
Emp. Form.:
C26H25Cl2N5O
Mol. Mass.:
494.416
SMILES:
Cc1cc(cc2nnc(Nc3ccc(OCCN4CCCC4)cc3)nc12)-c1c(Cl)cccc1Cl
: