Target
Integrin alpha-V/beta-3
Ligand
BDBM50166678
Substrate
Meas. Tech.
ChEMBL_438133 (CHEMBL887263)
IC50
0.38±n/a nM
Citation
 Raboisson, PDesjarlais, RLReed, RLattanze, JChaikin, MManthey, CLTomczuk, BEMarugán, JJ Identification of novel short chain 4-substituted indoles as potent alphavbeta3 antagonist using structure-based drug design. Eur J Med Chem 42:334-43 (2007)  
Target
Name:
Integrin alpha-V/beta-3
Synonyms:
ITGAV/ITGB3 | Integrin beta-3/Vitronectin receptor alpha
Type:
Enzyme
Mol. Mass.:
Description:
Components:
This complex has 2 components.
Component 1
Name:
Integrin alpha-V
Synonyms:
ITAV_HUMAN Integrin alpha-V/alpha-5 VNRA Vitronectin receptor | Vitronectin receptor subunit alpha
Type:
PROTEIN
Mol. Mass.:
116024.92
Organism:
Homo sapiens (Human)
Description:
ChEMBL_582336
Residue:
1048
  
Component 2
Name:
Integrin beta-3
Synonyms:
CD_antigen=CD61 GPIIIa ITGB3 Platelet membrane glycoprotein IIIa
Type:
Protein
Mol. Mass.:
87038.91
Organism:
Homo sapiens (Human)
Description:
P05106
Residue:
788
  
Inhibitor
Name:
BDBM50166678
Synonyms:
3-Benzo[1,3]dioxol-5-yl-3-{5-[2-(5,6,7,8-tetrahydro-[1,8]naphthyridin-2-yl)-ethoxy]-indol-1-yl}-propionic acid CHEMBL190309
Type:
Small organic molecule
Emp. Form.:
C28H27N3O5
Mol. Mass.:
485.5311
SMILES:
OC(=O)CC(c1ccc2OCOc2c1)n1ccc2cc(OCCc3ccc4CCCNc4n3)ccc12
: