Target
Metabotropic glutamate receptor 4
Ligand
BDBM50207814
Substrate
Meas. Tech.
ChEMBL_443091 (CHEMBL892222)
Ki
7400±n/a nM
Citation
 Marinozzi, MSerpi, MAmori, LGavilan Diaz, MCostantino, GMeyer, UFlor, PJGasparini, FHeckendorn, RKuhn, RGiorgi, GHermit, MBThomsen, CPellicciari, R Synthesis and preliminary pharmacological evaluation of the four stereoisomers of (2S)-2-(2'-phosphono-3'-phenylcyclopropyl)glycine, the first class of 3'-substituted trans C1'-2'-2-(2'-phosphonocyclopropyl)glycines. Bioorg Med Chem 15:3161-70 (2007)  
Target
Name:
Metabotropic glutamate receptor 4
Synonyms:
GRM4_RAT Grm4 Metabotropic glutamate receptor 4 (mGlu4) mGlu4 metabotropic glutamate 4a
Type:
Enzyme
Mol. Mass.:
101849.79
Organism:
Rattus norvegicus (Rat)
Description:
P31423
Residue:
912
  
Inhibitor
Name:
BDBM50207814
Synonyms:
(2S,1'R,2'S)-2-(2'-phosphonocyclopropyl)glycine | CHEMBL442076
Type:
Small organic molecule
Emp. Form.:
C5H10NO5P
Mol. Mass.:
195.1104
SMILES:
NC([C@H]1C[C@@H]1P(O)(O)=O)C(O)=O
: