Target
Vasopressin V2 receptor
Ligand
BDBM50221815
Substrate
Meas. Tech.
ChEMBL_446243 (CHEMBL895349)
Ki
>1000±n/a nM
Citation
 Albizu, LTeppaz, GSeyer, RBazin, HAnsanay, HManning, MMouillac, BDurroux, T Toward efficient drug screening by homogeneous assays based on the development of new fluorescent vasopressin and oxytocin receptor ligands. J Med Chem 50:4976-85 (2007)  
Target
Name:
Vasopressin V2 receptor
Synonyms:
ADHR AVPR2 DIR Renal-type arginine vasopressin receptor V2R_HUMAN Vasopressin V2 receptor | Vasopressin receptor
Type:
Receptor
Mol. Mass.:
40295.28
Organism:
Homo sapiens (Human)
Description:
P30518
Residue:
371
  
Inhibitor
Name:
BDBM50221815
Synonyms:
4-({[(6-{N-[(1S)-5-amino-1-carbamoylpentyl]-1-[(3S)-1-[(2S)-5-carbamimidamido-2-[(2S)-3-carbamoyl-2-[(2S)-4-carbamoyl-2-[(2S)-2-[(2R)-3-(4-hydroxyphenyl)-2-[3-(4-hydroxyphenyl)-N-methylpropanamido]propanamido]-3-phenylpropanamido]butanamido]propanamido]pentanoyl]pyrrolidin-3-yl]formamido}-6-oxohexyl)carbamoyl]methyl}sulfanyl)-2,3,5-trichloro-6-(2,2,4,8,10,10-hexamethyl-12,14-disulfonato-2,3,4,7,7a,8,9,10,12,12a-decahydro-1H-13-oxa-1,11-diazapentacen-6-yl)benzoate [Lys8(Alexa 488)]PVA
Type:
Small organic molecule
Emp. Form.:
C94H119Cl3N17O23S3
Mol. Mass.:
2057.606
SMILES:
[#6]-[#6]-1-[#6]C([#6])([#6])[#7]=[#6]-2-[#6]-1-[#6]-[#6]-1=[#6](-c3cc4-[#6](-[#6])-[#6]C([#6])([#6])[#7]-c4c(c3-[#8]-[#6]-1-[#6]-2S([#8-])(=O)=O)S([#8-])(=O)=O)-c1c(Cl)c(-[#16]-[#6]-[#6](=O)-[#7]-[#6]-[#6]-[#6]-[#6]-[#6]-[#6](=O)-[#7](-[#6@@H](-[#6]-[#6]-[#6]-[#6]-[#7])-[#6](-[#7])=O)-[#6](=O)-[#6@H]-2-[#6]-[#6]-[#7](-[#6]-2)-[#6](=O)-[#6@H](-[#6]-[#6]-[#6]\[#7]=[#6](\[#7])-[#7])-[#7]-[#6](=O)-[#6@H](-[#6]-[#6](-[#7])=O)-[#7]-[#6](=O)-[#6@H](-[#6]-[#6]-[#6](-[#7])=O)-[#7]-[#6](=O)-[#6@H](-[#6]-c2ccccc2)-[#7]-[#6](=O)-[#6@@H](-[#6]-c2ccc(-[#8])cc2)-[#7](-[#6])-[#6](=O)-[#6]-[#6]-c2ccc(-[#8])cc2)c(Cl)c(Cl)c1-[#6](-[#8-])=O
: