Target
Growth hormone secretagogue receptor type 1
Ligand
BDBM50222875
Substrate
Meas. Tech.
ChEMBL_446527 (CHEMBL895698)
Ki
0.9±n/a nM
Citation
 Rudolph, JEsler, WPO'connor, SCoish, PDWickens, PLBrands, MBierer, DEBloomquist, BTBondar, GChen, LChuang, CYClaus, THFathi, ZFu, WKhire, URKristie, JALiu, XGLowe, DBMcClure, ACMichels, MOrtiz, AARamsden, PDSchoenleber, RWShelekhin, TEVakalopoulos, ATang, WWang, LYi, LGardell, SJLivingston, JNSweet, LJBullock, WH Quinazolinone derivatives as orally available ghrelin receptor antagonists for the treatment of diabetes and obesity. J Med Chem 50:5202-16 (2007)  
Target
Name:
Growth hormone secretagogue receptor type 1
Synonyms:
Ghrelin receptor
Type:
PROTEIN
Mol. Mass.:
41494.35
Organism:
Ovis aries
Description:
ChEMBL_446527
Residue:
366
  
Inhibitor
Name:
BDBM50222875
Synonyms:
6-(4-fluorophenoxy)-2-(2-methylphenyl)-3-(piperidin-3-ylmethyl)quinazolin-4(3H)-one | CHEMBL429817
Type:
Small organic molecule
Emp. Form.:
C27H26FN3O2
Mol. Mass.:
443.5126
SMILES:
Cc1ccccc1-c1nc2ccc(Oc3ccc(F)cc3)cc2c(=O)n1CC1CCCNC1
: