Target
Carbonic anhydrase 9
Ligand
BDBM15222
Substrate
Meas. Tech.
ChEMBL_448895 (CHEMBL898041)
Ki
105±n/a nM
Citation
 Salmon, AJWilliams, MLInnocenti, AVullo, DSupuran, CTPoulsen, SA Inhibition of carbonic anhydrase isozymes I, II and IX with benzenesulfonamides containing an organometallic moiety. Bioorg Med Chem Lett 17:5032-5 (2007)  
Target
Name:
Carbonic anhydrase 9
Synonyms:
CA-IX CAH9_HUMAN Carbonic anhydrase 9 (CA IX) Carbonic anhydrase 9 precursor Carbonic anhydrase IX (CAIX) Carbonic anhydrases; II & IX MN RCC-associated antigen G250
Type:
Enzyme
Mol. Mass.:
49669.03
Organism:
Homo sapiens (Human)
Description:
Catalytic domain of human cloned isozyme was used in the assay
Residue:
459
  
Inhibitor
Name:
BDBM15222
Synonyms:
4-Azidobenzenesulfonamide CHEMBL222837 | azide 1
Type:
Small organic molecule
Emp. Form.:
C6H6N4O2S
Mol. Mass.:
198.202
SMILES:
NS(=O)(=O)c1ccc(cc1)N=[N+]=[N-]
: