Target
Carbonic anhydrase 3
Ligand
BDBM10863
Substrate
Meas. Tech.
ChEMBL_449604 (CHEMBL898699)
Ki
710000±n/a nM
Citation
 Nishimori, IMinakuchi, TOnishi, SVullo, DCecchi, AScozzafava, ASupuran, CT Carbonic anhydrase inhibitors: cloning, characterization, and inhibition studies of the cytosolic isozyme III with sulfonamides. Bioorg Med Chem 15:7229-36 (2007)  
Target
Name:
Carbonic anhydrase 3
Synonyms:
CA-III CAH3_HUMAN Carbonic Anhydrase III Carbonic anhydrase 3 (CA III) | Carbonic anhydrase III (CA III)
Type:
Enzyme
Mol. Mass.:
29562.11
Organism:
Homo sapiens (Human)
Description:
Human cloned isozyme.
Residue:
260
  
Inhibitor
Name:
BDBM10863
Synonyms:
4-Amino-3-chlorobenzenesulfonamide CHEMBL7092 halogenosulfanilamide deriv. 5c
Type:
Small organic molecule
Emp. Form.:
C6H7ClN2O2S
Mol. Mass.:
206.65
SMILES:
Nc1ccc(cc1Cl)S(N)(=O)=O
: