Target
Carbonic anhydrase 3
Ligand
BDBM11635
Substrate
Meas. Tech.
ChEMBL_449604 (CHEMBL898699)
Ki
1060000±n/a nM
Citation
 Nishimori, IMinakuchi, TOnishi, SVullo, DCecchi, AScozzafava, ASupuran, CT Carbonic anhydrase inhibitors: cloning, characterization, and inhibition studies of the cytosolic isozyme III with sulfonamides. Bioorg Med Chem 15:7229-36 (2007)  
Target
Name:
Carbonic anhydrase 3
Synonyms:
CA-III CAH3_HUMAN Carbonic Anhydrase III Carbonic anhydrase 3 (CA III) | Carbonic anhydrase III (CA III)
Type:
Enzyme
Mol. Mass.:
29562.11
Organism:
Homo sapiens (Human)
Description:
Human cloned isozyme.
Residue:
260
  
Inhibitor
Name:
BDBM11635
Synonyms:
4-sulfamoyl-N-[2-(4-sulfamoylphenyl)ethyl]benzamide Sulfonamide 2
Type:
Small organic molecule
Emp. Form.:
C15H17N3O5S2
Mol. Mass.:
383.443
SMILES:
NS(=O)(=O)c1ccc(CCNC(=O)c2ccc(cc2)S(N)(=O)=O)cc1
: