Target
Carbonic anhydrase 3
Ligand
BDBM10872
Substrate
Meas. Tech.
ChEMBL_449604 (CHEMBL898699)
Ki
140000±n/a nM
Citation
 Nishimori, IMinakuchi, TOnishi, SVullo, DCecchi, AScozzafava, ASupuran, CT Carbonic anhydrase inhibitors: cloning, characterization, and inhibition studies of the cytosolic isozyme III with sulfonamides. Bioorg Med Chem 15:7229-36 (2007)  
Target
Name:
Carbonic anhydrase 3
Synonyms:
CA-III CAH3_HUMAN Carbonic Anhydrase III Carbonic anhydrase 3 (CA III) | Carbonic anhydrase III (CA III)
Type:
Enzyme
Mol. Mass.:
29562.11
Organism:
Homo sapiens (Human)
Description:
Human cloned isozyme.
Residue:
260
  
Inhibitor
Name:
BDBM10872
Synonyms:
4-amino-N-[2-(4-sulfamoylphenyl)ethyl]benzene-1-sulfonamide aromatic/heteroaromatic sulfonamide 17
Type:
Small organic molecule
Emp. Form.:
C14H17N3O4S2
Mol. Mass.:
355.432
SMILES:
Nc1ccc(cc1)S(=O)(=O)NCCc1ccc(cc1)S(N)(=O)=O
: