Target
Serine/threonine-protein kinase Chk1
Ligand
BDBM50222917
Substrate
Meas. Tech.
ChEMBL_449978 (CHEMBL899086)
Ki
0.300000±n/a nM
Citation
 Teng, MZhu, JJohnson, MDChen, PKornmann, JChen, EBlasina, ARegister, JAnderes, KRogers, CDeng, YNinkovic, SGrant, SHu, QLundgren, KPeng, ZKania, RS Structure-based design and synthesis of (5-arylamino-2H-pyrazol-3-yl)-biphenyl-2',4'-diols as novel and potent human CHK1 inhibitors. J Med Chem 50:5253-6 (2007)  
Target
Name:
Serine/threonine-protein kinase Chk1
Synonyms:
CHEK1 CHK1 checkpoint homolog Checkpoint kinase-1 (CHK1)
Type:
Enzyme Catalytic Domain
Mol. Mass.:
54443.02
Organism:
Homo sapiens (Human)
Description:
gi_166295192
Residue:
476
  
Inhibitor
Name:
BDBM50222917
Synonyms:
4'-[5-(6-piperidin-1-ylmethyl-pyridin-3-ylamino)-1H-pyrazol-3-yl]-biphenyl-2,4-diol | CHEMBL241233
Type:
Small organic molecule
Emp. Form.:
C26H27N5O2
Mol. Mass.:
441.5249
SMILES:
Oc1ccc(c(O)c1)-c1ccc(cc1)-c1cc(Nc2ccc(CN3CCCCC3)nc2)[nH]n1
: