Target
Adenosine receptor A3
Ligand
BDBM50224351
Substrate
Meas. Tech.
ChEMBL_450737 (CHEMBL901020)
Ki
12.3±n/a nM
Citation
 Da Settimo, FPrimofiore, GTaliani, SMarini, AMLa Motta, CSimorini, FSalerno, SSergianni, VTuccinardi, TMartinelli, ACosimelli, BGreco, GNovellino, ECiampi, OTrincavelli, MLMartini, C 5-amino-2-phenyl[1,2,3]triazolo[1,2-a][1,2,4]benzotriazin-1-one: a versatile scaffold to obtain potent and selective A3 adenosine receptor antagonists. J Med Chem 50:5676-84 (2007)  
Target
Name:
Adenosine receptor A3
Synonyms:
A3 adenosine receptor (hA3) ADORA3 | Adenosine A3 receptor (A3AR)
Type:
G Protein-Coupled Receptor (GPCR)
Mol. Mass.:
36197.32
Organism:
Homo sapiens (Human)
Description:
P0DMS8
Residue:
318
  
Inhibitor
Name:
BDBM50224351
Synonyms:
CHEMBL235717 | N-(8-chloro-1-oxo-2-p-tolyl-1H-3,3a,5,9b-tetraaza-cyclopenta[a]naphthalen-4-yl)-4-methoxy-benzamide
Type:
Small organic molecule
Emp. Form.:
C24H18ClN5O3
Mol. Mass.:
459.884
SMILES:
COc1ccc(cc1)C(=O)Nc1nc2ccc(Cl)cc2n2n1nc(-c1ccc(C)cc1)c2=O
: