Target
P2Y purinoceptor 2
Ligand
BDBM50195844
Substrate
Meas. Tech.
ChEMBL_452954 (CHEMBL902099)
EC50
35±n/a nM
Citation
 Brookings, DDavenport, RJDavis, JGalvin, FCLloyd, SMack, SROwens, RSabin, VWynn, J Novel nucleotide triphosphates as potent P2Y2 agonists. Bioorg Med Chem Lett 17:562-5 (2007)  
Target
Name:
P2Y purinoceptor 2
Synonyms:
ATP receptor P2RY2 P2U purinoceptor 1 P2Y purinoceptor 2 Purinergic receptor | Purinergic receptor P2Y2
Type:
PROTEIN
Mol. Mass.:
42299.21
Organism:
Homo sapiens (Human)
Description:
ChEMBL_1455361
Residue:
377
  
Inhibitor
Name:
BDBM50195844
Synonyms:
({[({[(2R,3S,4R,5R)-3,4-dihydroxy-5-(6-methyl-1-oxo-1,2-dihydroisoquinolin-2-yl)oxolan-2-yl]methoxy}(hydroxy)phosphoryl)oxy](hydroxy)phosphoryl}oxy)phosphonic acid | CHEMBL241318
Type:
Small organic molecule
Emp. Form.:
C15H20NO14P3
Mol. Mass.:
531.2389
SMILES:
Cc1ccc2c(ccn([C@@H]3O[C@H](COP(O)(=O)OP(O)(=O)OP(O)(O)=O)[C@@H](O)[C@H]3O)c2=O)c1
: