Target
5-hydroxytryptamine receptor 2C
Ligand
BDBM50205784
Substrate
Meas. Tech.
ChEMBL_454644 (CHEMBL886664)
Ki
160±n/a nM
Citation
 Wilson, KJvan Niel, MBCooper, LBloomfield, DO'Connor, DFish, LRMacLeod, AM 2,5-Disubstituted pyridines: the discovery of a novel series of 5-HT2A ligands. Bioorg Med Chem Lett 17:2643-8 (2007)  
Target
Name:
5-hydroxytryptamine receptor 2C
Synonyms:
5-HT-2C 5-HT2C-INI 5-HTR2C 5-hydroxytryptamine receptor 2C (5-HT-2C) 5HT-1C HTR1C Serotonin (5-HT3) receptor Serotonin Receptor 2C
Type:
G Protein-Coupled Receptor (GPCR)
Mol. Mass.:
51836.79
Organism:
Homo sapiens (Human)
Description:
P28335
Residue:
458
  
Inhibitor
Name:
BDBM50205784
Synonyms:
(E)-2-(4-fluorostyryl)-5-(2-fluorophenylsulfinyl)pyridine | CHEMBL395459
Type:
Small organic molecule
Emp. Form.:
C19H13F2NOS
Mol. Mass.:
341.374
SMILES:
Fc1ccc(\C=C\c2ccc(cn2)S(=O)c2ccccc2F)cc1
: