Target
Muscarinic acetylcholine receptor M3
Ligand
BDBM50109647
Substrate
Meas. Tech.
ChEMBL_457002 (CHEMBL923345)
Ki
2.5±n/a nM
Citation
 Kumar, NKaur, KAeron, SDharmarajan, SSilamkoti, ADMehta, AGupta, SChugh, AGupta, JBSalman, MPalle, VPCliffe, IA Synthesis and optimization of novel and selective muscarinic M(3) receptor antagonists. Bioorg Med Chem Lett 17:5256-60 (2007)  
Target
Name:
Muscarinic acetylcholine receptor M3
Synonyms:
ACM3_RAT Chrm-3 | Chrm3
Type:
Enzyme Catalytic Domain
Mol. Mass.:
66086.66
Organism:
RAT
Description:
Cholinergic, muscarinic M3 CHRM3 RAT::P08483
Residue:
589
  
Inhibitor
Name:
BDBM50109647
Synonyms:
2-{1-[2-(2,3-Dihydro-benzofuran-5-yl)-ethyl]-pyrrolidin-3-yl}-2,2-diphenyl-acetamide (Darifenacin) DARIFENACIN Enablex
Type:
Small organic molecule
Emp. Form.:
C28H30N2O2
Mol. Mass.:
426.55
SMILES:
NC(=O)C([C@@H]1CCN(CCc2ccc3OCCc3c2)C1)(c1ccccc1)c1ccccc1
: