Target
3-oxoacyl-[acyl-carrier-protein] synthase 3
Ligand
BDBM50241313
Substrate
Meas. Tech.
ChEMBL_457362 (CHEMBL940953)
IC50
75000±n/a nM
Citation
 Bhowruth, VBrown, AKSenior, SJSnaith, JSBesra, GS Synthesis and biological evaluation of a C5-biphenyl thiolactomycin library. Bioorg Med Chem Lett 17:5643-6 (2007)  
Target
Name:
3-oxoacyl-[acyl-carrier-protein] synthase 3
Synonyms:
β-Ketoacyl-acyl carrier protein (ACP) synthase III (FabH) FABH_MYCTU | fabH
Type:
Enzyme
Mol. Mass.:
34865.07
Organism:
Mycobacterium tuberculosis
Description:
P9WNG3
Residue:
335
  
Inhibitor
Name:
BDBM50241313
Synonyms:
(5R)-4-hydroxy-3,5-dimethyl-5-[(1E)-2-methylbuta-1,3-dienyl]thiophen-2(5H)-one (R)-4-Hydroxy-3,5-dimethyl-5-((E)-2-methyl-buta-1,3-dienyl)-5H-thiophen-2-one 5R-Thiolactomycin TLM analog, 1
Type:
Small organic molecule
Emp. Form.:
C11H14O2S
Mol. Mass.:
210.293
SMILES:
CC1C(=O)S[C@](C)(\C=C(/C)C=C)C1=O
: