Target
Estrogen receptor
Ligand
BDBM50223233
Substrate
Meas. Tech.
ChEMBL_458134 (CHEMBL925467)
IC50
>10000±n/a nM
Citation
 Blizzard, TAGude, CMorgan, JDChan, WBirzin, ETMojena, MTudela, CChen, FKnecht, KSu, QKraker, BMosley, RTHolmes, MARohrer, SPHammond, ML Androstene-3,5-dienes as ER-beta selective SERMs. Bioorg Med Chem Lett 17:6295-8 (2007)  
Target
Name:
Estrogen receptor
Synonyms:
ER ESR ESR1_HUMAN Estrogen receptor Estrogen receptor (ER-alpha) Estrogen receptor alpha (ER) Nuclear receptor subfamily 3 group A member 1
Type:
Protein
Mol. Mass.:
66230.44
Organism:
Homo sapiens (Human)
Description:
P03372
Residue:
595
  
Inhibitor
Name:
BDBM50223233
Synonyms:
(8R,9S,10S,13S,14S,17S)-13-methyl-3-methylene-10-vinyl-2,3,6,7,8,9,10,11,12,13,14,15,16,17-tetradecahydro-1H-cyclopenta[a]phenanthren-17-ol | CHEMBL400480
Type:
Small organic molecule
Emp. Form.:
C21H30O
Mol. Mass.:
298.4623
SMILES:
C[C@]12CC[C@H]3[C@@H](CCC4=CC(=C)CC[C@]34C=C)[C@@H]1CC[C@@H]2O
: