Target
Ribosomal protein S6 kinase alpha-4
Ligand
BDBM50224883
Substrate
Meas. Tech.
ChEMBL_458401 (CHEMBL942722)
Ki
949±n/a nM
Citation
 Tao, ZFChen, ZBui, MHKovar, PJohnson, EBouska, JZhang, HRosenberg, SSowin, TLin, NH Macrocyclic ureas as potent and selective Chk1 inhibitors: an improved synthesis, kinome profiling, structure-activity relationships, and preliminary pharmacokinetics. Bioorg Med Chem Lett 17:6593-601 (2007)  
Target
Name:
Ribosomal protein S6 kinase alpha-4
Synonyms:
90 kDa ribosomal protein S6 kinase 4 MSK2 Nuclear mitogen- and stress-activated protein kinase 2 RPS6KA4(Kin.Dom.1 - N-terminal) Ribosomal protein S6 kinase Ribosomal protein S6 kinase alpha-4 | Ribosomal protein kinase B
Type:
Serine/threonine-protein kinase
Mol. Mass.:
85620.38
Organism:
Homo sapiens (Human)
Description:
Recombinant MSK2 was phosphorylated by incubation with active p38alpha before assays.
Residue:
772
  
Inhibitor
Name:
BDBM50224883
Synonyms:
7-chloro-3-oxo-8-[(thiazol-5-ylmethyl)-amino]-11,16-dioxa-2,4,19,21-tetraaza-tricyclo[15.3.1.0*5,10*]henicosa-1(21),5,7,9,17,19-hexaene-18-crbonitrile | CHEMBL248757
Type:
Small organic molecule
Emp. Form.:
C20H18ClN7O3S
Mol. Mass.:
471.92
SMILES:
Clc1cc2NC(=O)Nc3cnc(C#N)c(OCCCCOc2cc1NCc1cncs1)n3
: