Target
Pancreatic triacylglycerol lipase
Ligand
BDBM50213689
Substrate
Meas. Tech.
ChEMBL_459067 (CHEMBL925170)
IC50
27000±n/a nM
Citation
 Jain, KSKathiravan, MKSomani, RSShishoo, CJ The biology and chemistry of hyperlipidemia. Bioorg Med Chem 15:4674-99 (2007)  
Target
Name:
Pancreatic triacylglycerol lipase
Synonyms:
LIPP_HUMAN PNLIP | Pancreatic lipase
Type:
PROTEIN
Mol. Mass.:
51157.75
Organism:
Homo sapiens (Human)
Description:
ChEMBL_527250
Residue:
465
  
Inhibitor
Name:
BDBM50213689
Synonyms:
(S)-2-((2E,8E)-deca-2,8-dienoylamino)-3-((S)-5-hydroxy-6-oxo-3,8-dioxa-tricyclo[5.1.0.0*2,4*]oct-5-yl)-propionic acid methyl ester | CHEMBL254196
Type:
Small organic molecule
Emp. Form.:
C20H27NO7
Mol. Mass.:
393.4309
SMILES:
COC(=O)[C@H](C[C@]1(O)C2OC2C2OC2C1=O)NC(=O)\C=C\CCCC\C=C\C
: