Target
Cyclin-dependent kinase 5 activator 1
Ligand
BDBM50232478
Substrate
Meas. Tech.
ChEMBL_459333 (CHEMBL926493)
IC50
1500±n/a nM
Citation
 Hamann, MAlonso, DMartín-Aparicio, EFuertes, APérez-Puerto, MJCastro, AMorales, SNavarro, MLDel Monte-Millán, MMedina, MPennaka, HBalaiah, APeng, JCook, JWahyuono, SMartínez, A Glycogen synthase kinase-3 (GSK-3) inhibitory activity and structure-activity relationship (SAR) studies of the manzamine alkaloids. Potential for Alzheimer's disease. J Nat Prod 70:1397-405 (2007)  
Target
Name:
Cyclin-dependent kinase 5 activator 1
Synonyms:
CDK5/p35 Cyclin-dependent kinase 5 regulatory subunit 1 | Cyclin-dependent kinase 5/CDK5 activator 1
Type:
Protein Complex
Mol. Mass.:
Description:
Components:
This complex has 2 components.
Component 1
Name:
Cyclin-dependent kinase 5
Synonyms:
CDK5 CDKN5 Cyclin-dependent kinase 5 (CDK5/ p25) Cyclin-dependent-like kinase 5 PSSALRE Tau protein kinase II catalytic subunit
Type:
Enzyme Subunit
Mol. Mass.:
33308.61
Organism:
Homo sapiens (Human)
Description:
Residue:
292
  
Component 2
Name:
Cyclin-dependent kinase 5 activator 1
Synonyms:
CD5R1_HUMAN CDK5R1 Cyclin-dependent kinase 5 (CDK5/p25) NCK5A p35
Type:
Enzyme Subunit
Mol. Mass.:
34077.43
Organism:
Homo sapiens (Human)
Description:
Q15078
Residue:
307
  
Inhibitor
Name:
BDBM50232478
Synonyms:
CHEMBL403233
Type:
Small organic molecule
Emp. Form.:
C36H44N4O
Mol. Mass.:
548.7608
SMILES:
O[C@@]12CC\C=C/CCCCN3CC[C@@H](C(=C1)c1nccc4c5ccccc5[nH]c14)[C@]1(C[C@@H]4\C=C/CCCCN4[C@@H]21)C3
: