Target
Adenosine receptor A1
Ligand
BDBM50224770
Substrate
Meas. Tech.
ChEMBL_461289 (CHEMBL927309)
Ki
3.37±n/a nM
Citation
 Cappellacci, LFranchetti, PVita, PPetrelli, RLavecchia, ACosta, BSpinetti, FMartini, CKlotz, KNGrifantini, M 5'-Carbamoyl derivatives of 2'-C-methyl-purine nucleosides as selective A1 adenosine receptor agonists: affinity, efficacy, and selectivity for A1 receptor from different species. Bioorg Med Chem 16:336-53 (2008)  
Target
Name:
Adenosine receptor A1
Synonyms:
A1 adenosine receptor (hA1) AA1R_HUMAN ADORA1 Adenosine A1-receptor Adenosine receptor A1 (hA1) | Adenosine transporter (AdT)
Type:
G Protein-Coupled Receptor (GPCR)
Mol. Mass.:
36520.92
Organism:
Homo sapiens (Human)
Description:
P30542
Residue:
326
  
Inhibitor
Name:
BDBM50224770
Synonyms:
(2R,3R,4R,5R)-2-(2-chloro-6-(cyclopentylamino)-9H-purin-9-yl)-5-(hydroxymethyl)-3-methyl-tetrahydrofuran-3,4-diol | CHEMBL251997
Type:
Small organic molecule
Emp. Form.:
C16H22ClN5O4
Mol. Mass.:
383.83
SMILES:
C[C@@]1(O)[C@H](O)[C@@H](CO)O[C@H]1n1cnc2c(NC3CCCC3)nc(Cl)nc12
: