Target
Adenosine receptor A1
Ligand
BDBM50224759
Substrate
Meas. Tech.
ChEMBL_461281 (CHEMBL927305)
Ki
1.7±n/a nM
Citation
 Cappellacci, LFranchetti, PVita, PPetrelli, RLavecchia, ACosta, BSpinetti, FMartini, CKlotz, KNGrifantini, M 5'-Carbamoyl derivatives of 2'-C-methyl-purine nucleosides as selective A1 adenosine receptor agonists: affinity, efficacy, and selectivity for A1 receptor from different species. Bioorg Med Chem 16:336-53 (2008)  
Target
Name:
Adenosine receptor A1
Synonyms:
AA1R_BOVIN ADENOSINE A1 high ADORA1 | Adenosine A1 receptor
Type:
Enzyme Catalytic Domain
Mol. Mass.:
36602.99
Organism:
BOVINE
Description:
ADENOSINE 0 BOVINE::P28190
Residue:
326
  
Inhibitor
Name:
BDBM50224759
Synonyms:
(2R,3R,4S,5R)-2-(2-chloro-6-((R)-tetrahydrofuran-3-ylamino)-9H-purin-9-yl)-5-(hydroxymethyl)-tetrahydrofuran-3,4-diol | CHEMBL252198
Type:
Small organic molecule
Emp. Form.:
C14H18ClN5O5
Mol. Mass.:
371.776
SMILES:
OC[C@H]1O[C@H]([C@H](O)[C@@H]1O)n1cnc2c(N[C@@H]3CCOC3)nc(Cl)nc12
: