Target
Coagulation factor X
Ligand
BDBM50228915
Substrate
Meas. Tech.
ChEMBL_461701 (CHEMBL927722)
Ki
0.97±n/a nM
Citation
 Varnes, JGWacker, DAPinto, DJOrwat, MJTheroff, JPWells, BGalemo, RALuettgen, JMKnabb, RMBai, SHe, KLam, PYWexler, RR Structure-activity relationship and pharmacokinetic profile of 5-ketopyrazole factor Xa inhibitors. Bioorg Med Chem Lett 18:749-54 (2008)  
Target
Name:
Coagulation factor X
Synonyms:
Activated coagulation factor X (FXa) Coagulation factor X precursor F10 Factor X heavy chain Factor Xa Stuart-Prower factor
Type:
Enzyme
Mol. Mass.:
54726.60
Organism:
Homo sapiens (Human)
Description:
Residue:
488
  
Inhibitor
Name:
BDBM50228915
Synonyms:
1-[2-(3-amino-benzo[d]isoxazol-5-yl)-5-trifluoromethyl-2H-pyrazol-3-yl]-2-[4-(2-dimethylaminomethyl-imidazol-1-yl)-phenyl]-ethanone | CHEMBL442292
Type:
Small organic molecule
Emp. Form.:
C25H22F3N7O2
Mol. Mass.:
509.4831
SMILES:
CN(C)Cc1nccn1-c1ccc(CC(=O)c2cc(nn2-c2ccc3onc(N)c3c2)C(F)(F)F)cc1
: