Target
Sodium-dependent serotonin transporter
Ligand
BDBM50217576
Substrate
Meas. Tech.
ChEMBL_463176 (CHEMBL948190)
Ki
0.8±n/a nM
Citation
 Ly, KSLetavic, MAKeith, JMMiller, JMStocking, EMBarbier, AJBonaventure, PLord, BJiang, XBoggs, JDDvorak, LMiller, KLNepomuceno, DWilson, SJCarruthers, NI Synthesis and biological activity of piperazine and diazepane amides that are histamine H3 antagonists and serotonin reuptake inhibitors. Bioorg Med Chem Lett 18:39-43 (2008)  
Target
Name:
Sodium-dependent serotonin transporter
Synonyms:
5-HT Transporter 5HTT SC6A4_HUMAN SLC6A4 Serotonin transporter (5HTT) Sodium-dependent serotonin transporter (SERT) | Solute carrier family 6 member 4
Type:
Multi-pass membrane protein
Mol. Mass.:
70322.51
Organism:
Homo sapiens (Human)
Description:
P31645
Residue:
630
  
Inhibitor
Name:
BDBM50217576
Synonyms:
CHEMBL236046 N-methyl(2-(4-(methylthio)phenoxy)-5-(4-morpholinobut-1-ynyl)phenyl)methanamine
Type:
Small organic molecule
Emp. Form.:
C23H28N2O2S
Mol. Mass.:
396.546
SMILES:
CNCc1cc(ccc1Oc1ccc(SC)cc1)C#CCCN1CCOCC1
: