Target
B1 bradykinin receptor
Ligand
BDBM50371333
Substrate
Meas. Tech.
ChEMBL_463209 (CHEMBL947206)
Ki
0.35±n/a nM
Citation
 Wood, MRSchirripa, KMKim, JJKuduk, SDChang, RKDi Marco, CNDiPardo, RMWan, BLMurphy, KLRansom, RWChang, RSHolahan, MACook, JJLemaire, WMosser, SDBednar, RATang, CPrueksaritanont, TWallace, AAMei, QYu, JBohn, DLClayton, FCAdarayn, EDSitko, GRLeonard, YMFreidinger, RMPettibone, DJBock, MG Alpha-hydroxy amides as a novel class of bradykinin B1 selective antagonists. Bioorg Med Chem Lett 18:716-20 (2008)  
Target
Name:
B1 bradykinin receptor
Synonyms:
B1 BRADYKININ B1R BK-1 receptor BRADYB1 | Bradykinin B1 receptor
Type:
Enzyme
Mol. Mass.:
40508.87
Organism:
Homo sapiens (Human)
Description:
P46663
Residue:
353
  
Inhibitor
Name:
BDBM50371333
Synonyms:
CHEMBL256671
Type:
Small organic molecule
Emp. Form.:
C19H16Cl2F4N2O4
Mol. Mass.:
483.241
SMILES:
COC(=O)c1c(Cl)cc(Cl)cc1-c1cnc([C@@H](C)NC(=O)[C@@](C)(O)C(F)(F)F)c(F)c1
: