Target
Matrix metalloproteinase-9
Ligand
BDBM50371337
Substrate
Meas. Tech.
ChEMBL_463237 (CHEMBL930626)
Ki
>2128±n/a nM
Citation
 Ott, GRAsakawa, NLu, ZLiu, RQCovington, MBVaddi, KQian, MNewton, RCChrist, DDTraskos, JMDecicco, CPDuan, JJ Alpha,beta-cyclic-beta-benzamido hydroxamic acids: novel templates for the design, synthesis, and evaluation of selective inhibitors of TNF-alpha converting enzyme (TACE). Bioorg Med Chem Lett 18:694-9 (2008)  
Target
Name:
Matrix metalloproteinase-9
Synonyms:
67 kDa matrix metalloproteinase-9 92 kDa gelatinase CLG4B Gelatinase B MMP9 Matrix metalloproteinase 9 (MMP-9) Matrix metalloproteinase-9 (MMP9)
Type:
Enzyme
Mol. Mass.:
78452.28
Organism:
Homo sapiens (Human)
Description:
P14780
Residue:
707
  
Inhibitor
Name:
BDBM50371337
Synonyms:
CHEMBL439066
Type:
Small organic molecule
Emp. Form.:
C28H28N4O5
Mol. Mass.:
500.5457
SMILES:
Cc1cc(COc2ccc(cc2)C(=O)N[C@@H]2CN(Cc3ccco3)C[C@@H]2C(=O)NO)c2ccccc2n1
: