Target
72 kDa type IV collagenase
Ligand
BDBM50371348
Substrate
Meas. Tech.
ChEMBL_463236 (CHEMBL930625)
Ki
>3333±n/a nM
Citation
 Ott, GRAsakawa, NLu, ZLiu, RQCovington, MBVaddi, KQian, MNewton, RCChrist, DDTraskos, JMDecicco, CPDuan, JJ Alpha,beta-cyclic-beta-benzamido hydroxamic acids: novel templates for the design, synthesis, and evaluation of selective inhibitors of TNF-alpha converting enzyme (TACE). Bioorg Med Chem Lett 18:694-9 (2008)  
Target
Name:
72 kDa type IV collagenase
Synonyms:
72 kDa gelatinase CLG4A Gelatinase A (MMP-2) MMP2_HUMAN Matrix metalloproteinase-2 (MMP 2) Matrix metalloproteinases 2 (MMP-2) | TBE-1
Type:
Enzyme
Mol. Mass.:
73870.36
Organism:
Homo sapiens (Human)
Description:
P08253
Residue:
660
  
Inhibitor
Name:
BDBM50371348
Synonyms:
CHEMBL270819
Type:
Small organic molecule
Emp. Form.:
C27H30N4O5
Mol. Mass.:
490.5509
SMILES:
CC(C)C(=O)N1C[C@@H](NC(=O)c2ccc(OCc3cc(C)nc4ccccc34)cc2)[C@H](C1)C(=O)NO
: