Target
Matrix metalloproteinase-9
Ligand
BDBM50371346
Substrate
Meas. Tech.
ChEMBL_463237 (CHEMBL930626)
Ki
1851±n/a nM
Citation
 Ott, GRAsakawa, NLu, ZLiu, RQCovington, MBVaddi, KQian, MNewton, RCChrist, DDTraskos, JMDecicco, CPDuan, JJ Alpha,beta-cyclic-beta-benzamido hydroxamic acids: novel templates for the design, synthesis, and evaluation of selective inhibitors of TNF-alpha converting enzyme (TACE). Bioorg Med Chem Lett 18:694-9 (2008)  
Target
Name:
Matrix metalloproteinase-9
Synonyms:
67 kDa matrix metalloproteinase-9 92 kDa gelatinase CLG4B Gelatinase B MMP9 Matrix metalloproteinase 9 (MMP-9) Matrix metalloproteinase-9 (MMP9)
Type:
Enzyme
Mol. Mass.:
78452.28
Organism:
Homo sapiens (Human)
Description:
P14780
Residue:
707
  
Inhibitor
Name:
BDBM50371346
Synonyms:
CHEMBL256598
Type:
Small organic molecule
Emp. Form.:
C27H30N4O6
Mol. Mass.:
506.5503
SMILES:
CC(C)OC(=O)N1C[C@@H](NC(=O)c2ccc(OCc3cc(C)nc4ccccc34)cc2)[C@H](C1)C(=O)NO
: