Target
Matrilysin
Ligand
BDBM50229322
Substrate
Meas. Tech.
ChEMBL_463239 (CHEMBL930628)
Ki
6±n/a nM
Citation
 Ott, GRAsakawa, NLu, ZLiu, RQCovington, MBVaddi, KQian, MNewton, RCChrist, DDTraskos, JMDecicco, CPDuan, JJ Alpha,beta-cyclic-beta-benzamido hydroxamic acids: novel templates for the design, synthesis, and evaluation of selective inhibitors of TNF-alpha converting enzyme (TACE). Bioorg Med Chem Lett 18:694-9 (2008)  
Target
Name:
Matrilysin
Synonyms:
MMP7 MPSL1 Matrix metalloproteinase-7 (MMP-7) PUMP1
Type:
Enzyme
Mol. Mass.:
29681.54
Organism:
Homo sapiens (Human)
Description:
P09237
Residue:
267
  
Inhibitor
Name:
BDBM50229322
Synonyms:
(3S,4S)-N-hydroxy-4-(4-((2-methylquinolin-4-yl)methoxy)benzamido)-1-(prop-2-ynyl)pyrrolidine-3-carboxamide | CHEMBL271235
Type:
Small organic molecule
Emp. Form.:
C26H26N4O4
Mol. Mass.:
458.509
SMILES:
Cc1cc(COc2ccc(cc2)C(=O)N[C@@H]2CN(CC#C)C[C@@H]2C(=O)NO)c2ccccc2n1
: