Target
Receptor tyrosine-protein kinase erbB-2
Ligand
BDBM50371368
Substrate
Meas. Tech.
ChEMBL_463270 (CHEMBL930659)
IC50
31±n/a nM
Citation
 Barlaam, BBallard, PBradbury, RHDucray, RGermain, HHickinson, DMHudson, KKettle, JGKlinowska, TMagnien, FOgilvie, DJOlivier, APearson, SEScott, JSSuleman, ATrigwell, CBVautier, MWhittaker, RDWood, R A new series of neutral 5-substituted 4-anilinoquinazolines as potent, orally active inhibitors of erbB2 receptor tyrosine kinase. Bioorg Med Chem Lett 18:674-8 (2008)  
Target
Name:
Receptor tyrosine-protein kinase erbB-2
Synonyms:
2.7.10.1 CD_antigen=CD340 ERBB2_HUMAN FASN/HER2 HER2 MLN19 NEU Proto-oncogene Neu Tyrosine kinase-type cell surface receptor HER2 | p185erbB2
Type:
Mol. Mass.:
137894.47
Organism:
Homo sapiens (Human)
Description:
P04626
Residue:
1255
  
Inhibitor
Name:
BDBM50371368
Synonyms:
CHEMBL258313
Type:
Small organic molecule
Emp. Form.:
C26H26ClN5O4
Mol. Mass.:
507.969
SMILES:
C[C@@H](Oc1cccc2ncnc(Nc3ccc(OCc4ccccn4)c(Cl)c3)c12)C(=O)N(C)CCO
: