Target
5-hydroxytryptamine receptor 2C
Ligand
BDBM50371434
Substrate
Meas. Tech.
ChEMBL_463653 (CHEMBL930821)
Ki
208±n/a nM
Citation
 Peters, JULübbers, TAlanine, AKolczewski, SBlasco, FSteward, L Cyclic guanidines as dual 5-HT5A/5-HT7 receptor ligands: structure-activity relationship elucidation. Bioorg Med Chem Lett 18:256-61 (2008)  
Target
Name:
5-hydroxytryptamine receptor 2C
Synonyms:
5-HT-2C 5-HT2C-INI 5-HTR2C 5-hydroxytryptamine receptor 2C (5-HT-2C) 5HT-1C HTR1C Serotonin (5-HT3) receptor Serotonin Receptor 2C
Type:
G Protein-Coupled Receptor (GPCR)
Mol. Mass.:
51836.79
Organism:
Homo sapiens (Human)
Description:
P28335
Residue:
458
  
Inhibitor
Name:
BDBM50371434
Synonyms:
CHEMBL1548
Type:
Small organic molecule
Emp. Form.:
C8H7Cl2N3
Mol. Mass.:
216.067
SMILES:
NC1=Nc2ccc(Cl)c(Cl)c2CN1
: