Target
C-X-C chemokine receptor type 3
Ligand
BDBM50371507
Substrate
Meas. Tech.
ChEMBL_463733 (CHEMBL932091)
IC50
16±n/a nM
Citation
 Du, XChen, XMihalic, JTDeignan, JDuquette, JLi, ARLemon, BMa, JMiao, SEbsworth, KSullivan, TJTonn, GCollins, TLMedina, JC Design and optimization of imidazole derivatives as potent CXCR3 antagonists. Bioorg Med Chem Lett 18:608-13 (2008)  
Target
Name:
C-X-C chemokine receptor type 3
Synonyms:
AAO92295.1 C-X-C chemokine receptor type 3 (CXCR3) CXCR3 CXCR3_HUMAN chemokine (C-X-C motif) receptor 3
Type:
Enzyme Catalytic Domain
Mol. Mass.:
40665.65
Organism:
Homo sapiens (Human)
Description:
Residue:
368
  
Inhibitor
Name:
BDBM50371507
Synonyms:
CHEMBL437598
Type:
Small organic molecule
Emp. Form.:
C30H32F4N4O3S
Mol. Mass.:
604.659
SMILES:
CCc1c(nc([C@@H](C)N(CCS(=O)(=O)CC)C(=O)Cc2ccc(F)c(c2)C(F)(F)F)n1-c1ccc(cc1)C#N)C1CC1
: