Target
C-X-C chemokine receptor type 3
Ligand
BDBM50371513
Substrate
Meas. Tech.
ChEMBL_463733 (CHEMBL932091)
IC50
19±n/a nM
Citation
 Du, XChen, XMihalic, JTDeignan, JDuquette, JLi, ARLemon, BMa, JMiao, SEbsworth, KSullivan, TJTonn, GCollins, TLMedina, JC Design and optimization of imidazole derivatives as potent CXCR3 antagonists. Bioorg Med Chem Lett 18:608-13 (2008)  
Target
Name:
C-X-C chemokine receptor type 3
Synonyms:
AAO92295.1 C-X-C chemokine receptor type 3 (CXCR3) CXCR3 CXCR3_HUMAN chemokine (C-X-C motif) receptor 3
Type:
Enzyme Catalytic Domain
Mol. Mass.:
40665.65
Organism:
Homo sapiens (Human)
Description:
Residue:
368
  
Inhibitor
Name:
BDBM50371513
Synonyms:
CHEMBL402375
Type:
Small organic molecule
Emp. Form.:
C33H34F3N7O4S
Mol. Mass.:
681.728
SMILES:
CCOc1ccc(cc1)-n1cc(nc1[C@@H](C)N(CCS(=O)(=O)CC)C(=O)Cn1nnc(n1)-c1ccc(cc1)C(F)(F)F)-c1ccccc1
: