Target
P2Y purinoceptor 2
Ligand
BDBM50371610
Substrate
Meas. Tech.
ChEMBL_463782 (CHEMBL932171)
EC50
44±n/a nM
Citation
 Douglass, JGPatel, RIYerxa, BRShaver, SRWatson, PSBednarski, KPlourde, RRedick, CCBrubaker, KJones, ACBoyer, JL Lipophilic modifications to dinucleoside polyphosphates and nucleotides that confer antagonist properties at the platelet P2Y12 receptor. J Med Chem 51:1007-25 (2008)  
Target
Name:
P2Y purinoceptor 2
Synonyms:
ATP receptor P2RY2 P2U purinoceptor 1 P2Y purinoceptor 2 Purinergic receptor | Purinergic receptor P2Y2
Type:
PROTEIN
Mol. Mass.:
42299.21
Organism:
Homo sapiens (Human)
Description:
ChEMBL_1455361
Residue:
377
  
Inhibitor
Name:
BDBM50371610
Synonyms:
CHEMBL1162198
Type:
Small organic molecule
Emp. Form.:
C18H27N5O22P4
Mol. Mass.:
789.3223
SMILES:
Nc1ccn([C@@H]2O[C@H](COP(O)(=O)OP(O)(=O)OP(O)(=O)OP(O)(=O)OC[C@@H]3O[C@@H]([C@@H](O)[C@H]3O)n3ccc(=O)[nH]c3=O)[C@@H](O)[C@H]2O)c(=O)n1
: