Target
Growth hormone secretagogue receptor type 1
Ligand
BDBM50371697
Substrate
Meas. Tech.
ChEMBL_463847 (CHEMBL934041)
Ki
737±n/a nM
Citation
 Hernández, ASSwartz, SGSlusarchyk, DYan, MSeethala, RKSleph, PGrover, GDickinson, KGiupponi, LHarper, TWHumphreys, WGLonghi, DAFlynn, NMurphy, BJGordon, DABiller, SARobl, JATino, JA Optimization of 1H-tetrazole-1-alkanenitriles as potent orally bioavailable growth hormone secretagogues. Bioorg Med Chem Lett 18:2067-72 (2008)  
Target
Name:
Growth hormone secretagogue receptor type 1
Synonyms:
GH-releasing peptide receptor GHS-R GHSR_HUMAN Ghrelin receptor | Ghrelin receptor 1a (GHS-R1a)
Type:
Receptor
Mol. Mass.:
41334.57
Organism:
Homo sapiens (Human)
Description:
Receptor binding studies use plasma membranes from LLC PK-1 cells transiently transfected with hGHSR1a.
Residue:
366
  
Inhibitor
Name:
BDBM50371697
Synonyms:
CHEMBL404336
Type:
Small organic molecule
Emp. Form.:
C25H29N7O2
Mol. Mass.:
459.5435
SMILES:
CC(C)(N)C(=O)N[C@H](COCc1ccccc1)c1nnnn1C(CC#N)\C=C\c1ccccc1
: