Target
P2Y purinoceptor 2
Ligand
BDBM50227015
Substrate
Meas. Tech.
ChEMBL_463988 (CHEMBL929975)
IC50
12000±n/a nM
Citation
 Weyler, SBaqi, YHillmann, PKaulich, MHunder, AMMüller, IAMüller, CE Combinatorial synthesis of anilinoanthraquinone derivatives and evaluation as non-nucleotide-derived P2Y2 receptor antagonists. Bioorg Med Chem Lett 18:223-7 (2008)  
Target
Name:
P2Y purinoceptor 2
Synonyms:
ATP receptor P2U purinoceptor 1 P2Y purinoceptor 2 P2ru1 Purinergic receptor | Purinergic receptor P2Y2
Type:
PROTEIN
Mol. Mass.:
42202.78
Organism:
Mus musculus
Description:
ChEMBL_587770
Residue:
373
  
Inhibitor
Name:
BDBM50227015
Synonyms:
CHEMBL271688 sodium 4-(4-acetamidophenylamino)-1-amino-9,10-dioxo-9,10-dihydroanthracene-2-sulfonate
Type:
Small organic molecule
Emp. Form.:
C22H16N3O6S
Mol. Mass.:
450.444
SMILES:
CC(=O)Nc1ccc(Nc2cc(c(N)c3C(=O)c4ccccc4C(=O)c23)S([O-])(=O)=O)cc1
: