Target
Platelet-derived growth factor receptor beta
Ligand
BDBM50371914
Substrate
Meas. Tech.
ChEMBL_464346 (CHEMBL951201)
IC50
>1000±n/a nM
Citation
 Wall, MJChen, JMeegalla, SBallentine, SKWilson, KJDesJarlais, RLSchubert, CChaikin, MACrysler, CPetrounia, IPDonatelli, RRYurkow, EJBoczon, LMazzulla, MPlayer, MRPatch, RJManthey, CLMolloy, CTomczuk, BIllig, CR Synthesis and evaluation of novel 3,4,6-substituted 2-quinolones as FMS kinase inhibitors. Bioorg Med Chem Lett 18:2097-102 (2008)  
Target
Name:
Platelet-derived growth factor receptor beta
Synonyms:
Beta-type platelet-derived growth factor receptor CD140b antigen PDGF Receptor Substrate PDGFR PDGFR-1 PDGFRB PGFRB_HUMAN Platelet-derived growth factor receptor 1 Platelet-derived growth factor receptor beta (PDGFR-beta) Platelet-derived growth factor receptor beta (PDGFRbeta) | VHL/PDGFRB
Type:
Enzyme
Mol. Mass.:
123922.25
Organism:
Homo sapiens (Human)
Description:
P09619
Residue:
1106
  
Inhibitor
Name:
BDBM50371914
Synonyms:
CHEMBL403661
Type:
Small organic molecule
Emp. Form.:
C21H18ClN3O
Mol. Mass.:
363.84
SMILES:
CCc1ccc(cc1)-c1c(-c2c[nH]c(C)n2)c(=O)[nH]c2ccc(Cl)cc12
: