Target
Liver carboxylesterase 1
Ligand
BDBM50371959
Substrate
Meas. Tech.
ChEMBL_464381 (CHEMBL931030)
IC50
65±n/a nM
Citation
 Wheelock, CENishi, KYing, AJones, PDColvin, MEOlmstead, MMHammock, BD Influence of sulfur oxidation state and steric bulk upon trifluoromethyl ketone (TFK) binding kinetics to carboxylesterases and fatty acid amide hydrolase (FAAH). Bioorg Med Chem 16:2114-30 (2008)  
Target
Name:
Liver carboxylesterase 1
Synonyms:
Acyl coenzyme A:cholesterol acyltransferase CES1 EST1_HUMAN Serine hydrolase (CES1)
Type:
Protein
Mol. Mass.:
62520.83
Organism:
Homo sapiens (Human)
Description:
Residue:
567
  
Inhibitor
Name:
BDBM50371959
Synonyms:
CHEMBL86668
Type:
Small organic molecule
Emp. Form.:
C12H21F3O
Mol. Mass.:
238.2897
SMILES:
CCCCCCCCCCC(=O)C(F)(F)F
: