Target
Carboxylic ester hydrolase
Ligand
BDBM50371970
Substrate
Meas. Tech.
ChEMBL_464387 (CHEMBL930036)
IC50
22±n/a nM
Citation
 Wheelock, CENishi, KYing, AJones, PDColvin, MEOlmstead, MMHammock, BD Influence of sulfur oxidation state and steric bulk upon trifluoromethyl ketone (TFK) binding kinetics to carboxylesterases and fatty acid amide hydrolase (FAAH). Bioorg Med Chem 16:2114-30 (2008)  
Target
Name:
Carboxylic ester hydrolase
Synonyms:
Juvenile hormone esterase | Juvenile hormone esterase (JHE)
Type:
Protein
Mol. Mass.:
64567.21
Organism:
Manduca sexta (Moths)
Description:
Residue:
573
  
Inhibitor
Name:
BDBM50371970
Synonyms:
CHEMBL89506
Type:
Small organic molecule
Emp. Form.:
C11H19F3OS
Mol. Mass.:
256.328
SMILES:
CCCCCCCCSCC(=O)C(F)(F)F
: