Target
Liver carboxylesterase 1
Ligand
BDBM50371970
Substrate
Meas. Tech.
ChEMBL_464382 (CHEMBL930031)
IC50
13±n/a nM
Citation
 Wheelock, CENishi, KYing, AJones, PDColvin, MEOlmstead, MMHammock, BD Influence of sulfur oxidation state and steric bulk upon trifluoromethyl ketone (TFK) binding kinetics to carboxylesterases and fatty acid amide hydrolase (FAAH). Bioorg Med Chem 16:2114-30 (2008)  
Target
Name:
Liver carboxylesterase 1
Synonyms:
Acyl coenzyme A:cholesterol acyltransferase CES1 EST1_HUMAN Serine hydrolase (CES1)
Type:
Protein
Mol. Mass.:
62520.83
Organism:
Homo sapiens (Human)
Description:
Residue:
567
  
Inhibitor
Name:
BDBM50371970
Synonyms:
CHEMBL89506
Type:
Small organic molecule
Emp. Form.:
C11H19F3OS
Mol. Mass.:
256.328
SMILES:
CCCCCCCCSCC(=O)C(F)(F)F
: