Target
Liver carboxylesterase 1
Ligand
BDBM22722
Substrate
Meas. Tech.
ChEMBL_464392 (CHEMBL930041)
IC50
43±n/a nM
Citation
 Wheelock, CENishi, KYing, AJones, PDColvin, MEOlmstead, MMHammock, BD Influence of sulfur oxidation state and steric bulk upon trifluoromethyl ketone (TFK) binding kinetics to carboxylesterases and fatty acid amide hydrolase (FAAH). Bioorg Med Chem 16:2114-30 (2008)  
Target
Name:
Liver carboxylesterase 1
Synonyms:
Acyl coenzyme A:cholesterol acyltransferase CES1 EST1_HUMAN Serine hydrolase (CES1)
Type:
Protein
Mol. Mass.:
62520.83
Organism:
Homo sapiens (Human)
Description:
Residue:
567
  
Inhibitor
Name:
BDBM22722
Synonyms:
1,2-diphenylethane-1,2-dione CHEMBL189886 | Diphenylethane-1,2-dione
Type:
Small organic molecule
Emp. Form.:
C14H10O2
Mol. Mass.:
210.228
SMILES:
O=C(C(=O)c1ccccc1)c1ccccc1
: