Target
Prostaglandin E2 receptor EP4 subtype
Ligand
BDBM50372063
Substrate
Meas. Tech.
ChEMBL_464678 (CHEMBL934070)
Ki
0.38±n/a nM
Citation
 Burch, JDBelley, MFortin, RDeschênes, DGirard, MColucci, JFarand, JTherien, AGMathieu, MCDenis, DVigneault, ELévesque, JFGagné, SWrona, MXu, DClark, PRowland, SHan, Y Structure-activity relationships and pharmacokinetic parameters of quinoline acylsulfonamides as potent and selective antagonists of the EP(4) receptor. Bioorg Med Chem Lett 18:2048-54 (2008)  
Target
Name:
Prostaglandin E2 receptor EP4 subtype
Synonyms:
PE2R4_HUMAN PGE2 receptor EP4 subtype PTGER4 Prostanoid EP4 receptor
Type:
Enzyme
Mol. Mass.:
53134.53
Organism:
Homo sapiens (Human)
Description:
P35408
Residue:
488
  
Inhibitor
Name:
BDBM50372063
Synonyms:
CHEMBL271095
Type:
Small organic molecule
Emp. Form.:
C32H27F6N3O7S
Mol. Mass.:
711.628
SMILES:
COc1ccccc1CC(=O)NS(=O)(=O)Cc1ccc(N2Cc3c(C2=O)c(OCC(F)(F)F)c2cccnc2c3OCC(F)(F)F)c(C)c1
: