Target
Fatty-acid amide hydrolase 1 [30-579]
Ligand
BDBM50228837
Substrate
Meas. Tech.
ChEMBL_464889 (CHEMBL949088)
Ki
0.2±n/a nM
Citation
 Kimball, FSRomero, FAEzzili, CGarfunkle, JRayl, TJHochstatter, DGHwang, IBoger, DL Optimization of alpha-ketooxazole inhibitors of fatty acid amide hydrolase. J Med Chem 51:937-47 (2008)  
Target
Name:
Fatty-acid amide hydrolase 1 [30-579]
Synonyms:
Anandamide amidohydrolase 1 Faah Fatty Acid Amide Hydrolase Fatty-acid amide hydrolase (FAAH) Fatty-acid amide hydrolase 1 (FAAH) Oleamide hydrolase 1
Type:
Single-pass membrane protein; homodimer
Mol. Mass.:
60474.00
Organism:
Rattus norvegicus (rat)
Description:
P97612 (aa 30-579)
Residue:
550
  
Inhibitor
Name:
BDBM50228837
Synonyms:
2-(3-(biphenyl-4-yl)propanoyl)oxazole-5-carbonitrile CHEMBL272111
Type:
Small organic molecule
Emp. Form.:
C19H14N2O2
Mol. Mass.:
302.3267
SMILES:
O=C(CCc1ccc(cc1)-c1ccccc1)c1ncc(o1)C#N
: