Target
Vasopressin V2 receptor
Ligand
BDBM50372608
Substrate
Meas. Tech.
ChEMBL_465441 (CHEMBL946025)
Ki
950±n/a nM
Citation
 Liddle, JAllen, MJBorthwick, ADBrooks, DPDavies, DEEdwards, RMExall, AMHamlett, CIrving, WRMason, AMMcCafferty, GPNerozzi, FPeace, SPhilp, JPollard, DPullen, MAShabbir, SSSollis, SLWestfall, TDWoollard, PMWu, CHickey, DM The discovery of GSK221149A: a potent and selective oxytocin antagonist. Bioorg Med Chem Lett 18:90-4 (2008)  
Target
Name:
Vasopressin V2 receptor
Synonyms:
ADHR AVPR2 DIR Renal-type arginine vasopressin receptor V2R_HUMAN Vasopressin V2 receptor | Vasopressin receptor
Type:
Receptor
Mol. Mass.:
40295.28
Organism:
Homo sapiens (Human)
Description:
P30518
Residue:
371
  
Inhibitor
Name:
BDBM50372608
Synonyms:
CHEMBL429736 | GSK-221149A
Type:
Small organic molecule
Emp. Form.:
C27H34N4O5
Mol. Mass.:
494.5827
SMILES:
CC[C@H](C)[C@H]1N([C@@H](C(=O)N2CCOCC2)c2coc(C)n2)C(=O)[C@H](NC1=O)C1Cc2ccccc2C1
: